rec_id,idno,site,assessor,date,day,time,unobserved,activestim,l_bed,l_amenities,l_dining,l_outside,l_hallway,l_therapy,l_offunit,l_other,l_other_spec,pp_medical,pp_medical_nu,pp_nurse,pp_nurse_nu,pp_pts,pp_pts_nu,pp_therapists,pp_therapists_nu,pp_visitors,pp_visitors_nu,pp_other,pp_other_spec,pp_other_nu,pp_alone,act_p_repos,act_p_sit,act_p_trans,act_p_stand,act_p_mobwc,act_p_mobwal,act_p_adl,act_p_padl,act_p_arm,act_p_therapy,act_p_other,act_p_other_spec,act_c_music,act_c_puzgame,act_c_writart,act_c_reading,act_c_intergam,act_c_comp,act_c_tablet,act_c_therapy,act_c_other,act_c_other_spec,act_s_touchcont,act_s_talk,act_s_laugh,act_s_phone,act_s_group,act_s_other,act_s_other_spec,position,sleeping,noactivity,pp_number,noactivity_spec,unobserved_spec,comments,activity_complete
3150-1,2656-01,1,RLS,18/9/2018,TUE,800,0,0,1,0,0,0,0,0,0,0,,0,0,0,0,0,0,0,0,0,0,0,,0,1,0,0,0,0,0,0,0,0,0,0,0,,0,0,0,0,0,0,0,0,0,,0,0,0,0,0,0,,1,0,1,1,lying in bed awake,,,0
3150-2,2656-01,1,RLS,18/9/2018,TUE,810,2,1,0,1,0,0,0,0,0,0,,0,0,0,0,0,0,0,0,0,0,0,,0,1,0,0,0,0,0,0,0,1,0,0,0,,0,0,0,0,0,0,0,0,0,,0,0,0,0,0,0,,2,0,0,1,,,,0
3150-3,2656-01,1,RLS,18/9/2018,TUE,820,0,0,1,0,0,0,0,0,0,0,,0,0,1,1,0,0,0,0,0,0,0,,0,0,0,1,0,0,0,0,0,0,0,0,0,,0,0,0,0,0,0,0,0,0,,0,1,0,0,0,0,,2,0,0,2,,,,0
3150-4,2656-01,1,RLS,18/9/2018,TUE,830,0,0,1,0,0,0,0,0,0,0,,0,0,0,0,0,0,0,0,0,0,0,,0,1,0,1,0,0,0,0,0,0,0,0,0,,0,0,0,0,0,0,0,0,0,,0,0,0,1,0,0,,2,0,0,1,,,talking on the phone,0
3150-5,2656-01,1,RLS,18/9/2018,TUE,840,0,0,1,0,0,0,0,0,0,0,,0,0,0,0,0,0,0,0,0,0,0,,0,1,0,0,0,0,0,0,0,0,0,0,0,,0,0,0,0,0,0,0,0,0,,0,0,0,0,0,0,,2,0,1,1,Sitting in wheelchair at threshold to corridor watching people go by,,,0
3150-6,2656-01,1,RLS,18/9/2018,TUE,850,0,0,1,0,0,0,0,0,0,0,,0,0,0,0,0,0,0,0,0,0,1,nursing student,1,0,0,0,0,0,0,0,0,0,0,0,0,,0,0,0,0,0,0,0,0,0,,0,0,0,0,0,0,,2,0,1,2,"Sitting in wheelchair at threshold to corridor watching people go by. Nursing student was standing in hall, but not interacting.",,,0
3150-7,2656-01,1,RLS,18/9/2018,TUE,900,0,0,1,0,0,0,0,0,0,0,,0,0,1,1,0,0,0,0,0,0,0,,0,0,0,0,0,0,0,0,0,0,0,0,0,,0,0,0,0,0,0,0,0,0,,0,1,0,0,0,0,,2,0,0,2,,,,0
3150-8,2656-01,1,RLS,18/9/2018,TUE,910,0,0,1,0,0,0,0,0,0,0,,0,0,0,0,0,0,0,0,0,0,0,,0,1,0,0,0,0,0,0,0,0,0,0,0,,0,0,0,0,0,0,0,0,0,,0,0,0,0,0,0,,2,0,1,1,Sitting in wheelchair looking at construction out window,,,0
3150-9,2656-01,1,RLS,18/9/2018,TUE,920,4,1,1,0,0,0,0,0,0,0,,0,0,0,0,0,0,0,0,0,0,0,,0,1,,,,,,,,,,,,,,,,,,,,,,,,,,,,,,2,0,,1,,,,0
3150-10,2656-01,1,RLS,18/9/2018,TUE,930,0,0,1,0,0,0,0,0,0,0,,0,0,0,0,0,0,0,0,0,0,0,,0,1,0,0,0,0,0,0,0,0,0,0,0,,0,0,0,0,0,0,0,0,0,,0,0,0,0,0,0,,2,0,1,1,Sitting in wheelchair looking at construction out window,,,0
3150-11,2656-01,1,RLS,18/9/2018,TUE,940,0,0,0,0,0,0,0,1,0,0,,0,0,0,0,0,0,1,2,0,0,0,,0,0,0,0,1,0,0,0,0,0,0,0,0,,0,0,0,0,0,0,0,0,0,,0,1,0,0,0,0,,2,0,0,11,,,transferring from wheelchair to assisted standing,0
3150-12,2656-01,1,RLS,18/9/2018,TUE,950,0,0,0,0,0,0,0,1,0,0,,0,0,0,0,0,0,1,2,0,0,0,,0,0,0,0,0,0,0,0,0,0,0,0,0,,0,0,0,0,0,0,0,0,0,,0,1,0,0,0,0,,2,0,0,14,,,sitting in wheelchair while therapist set up equipment,0
3150-13,2656-01,1,RLS,18/9/2018,TUE,1000,0,0,0,0,0,0,0,1,0,0,,0,0,0,0,0,0,1,2,0,0,0,,0,0,0,0,0,0,0,0,0,0,0,1,0,,0,0,0,0,0,0,0,0,0,,0,1,0,0,0,0,,2,0,0,12,,,sitting on edge of bed lifting leg,0
3150-14,2656-01,1,RLS,18/9/2018,TUE,1010,0,0,0,0,0,0,0,1,0,0,,0,0,0,0,0,0,1,4,0,0,0,,0,0,0,1,0,0,0,0,0,0,0,0,0,,0,0,0,0,0,0,0,0,0,,0,1,0,0,0,0,,2,0,0,20,,,sitting on edge of bed talking to therapist,0
3150-15,2656-01,1,RLS,18/9/2018,TUE,1020,0,0,0,0,0,0,0,1,0,0,,0,0,0,0,0,0,1,3,0,0,0,,0,0,0,0,0,0,0,0,0,0,0,1,0,,0,0,0,0,0,0,0,0,0,,0,1,0,0,0,0,,3,0,0,15,,,standing with assistance,0
3150-16,2656-01,1,RLS,18/9/2018,TUE,1030,0,0,0,0,0,0,1,0,0,0,,0,0,0,0,1,1,1,1,0,0,0,,0,0,0,0,0,0,0,0,0,0,0,0,0,,0,0,0,0,0,0,0,0,0,,0,0,0,0,0,0,,2,0,0,3,,,electric wheelchair along corridor to lift and waiting outside lift,0
3150-17,2656-01,1,RLS,18/9/2018,TUE,1040,0,0,1,0,0,0,0,0,0,0,,0,0,0,0,0,0,1,1,0,0,0,,0,0,0,0,0,0,0,0,1,0,0,0,0,,0,0,0,0,0,0,0,1,0,,0,1,0,0,0,0,,2,0,0,2,,,speech therapy,0
3150-18,2656-01,1,RLS,18/9/2018,TUE,1050,0,0,1,0,0,0,0,0,0,0,,0,0,0,0,0,0,1,1,0,0,0,,0,0,0,0,0,0,0,0,1,0,0,0,0,,0,0,0,0,0,0,0,1,0,,0,1,0,0,0,0,,2,0,0,2,,,speech therapy,0
3150-19,2656-01,1,RLS,18/9/2018,TUE,1100,0,0,1,0,0,0,0,0,0,0,,0,0,0,0,0,0,1,1,0,0,0,,0,0,0,0,0,0,0,0,1,0,0,0,0,,0,0,0,0,0,0,0,1,0,,0,1,0,0,0,0,,2,0,0,2,,,speech therapy,0
3150-20,2656-01,1,RLS,18/9/2018,TUE,1110,0,0,1,0,0,0,0,0,0,0,,0,0,0,0,0,0,1,2,0,0,0,,0,0,0,0,0,0,0,0,1,0,0,0,0,,0,0,0,0,0,0,0,1,0,,0,1,0,0,0,0,,2,0,0,3,,,speech therapy,0
3150-21,2656-01,1,RLS,18/9/2018,TUE,1120,0,0,1,0,0,0,0,0,0,0,,0,0,0,0,0,0,1,2,0,0,0,,0,0,0,0,0,0,0,0,1,0,0,0,0,,0,0,0,0,0,0,0,1,0,,0,1,0,0,0,0,,2,0,0,3,,,speech therapy,0
3150-22,2656-01,1,RLS,18/9/2018,TUE,1130,0,0,1,0,0,0,0,0,0,0,,0,0,0,0,0,0,1,2,0,0,0,,0,0,0,0,0,0,0,0,1,0,0,0,0,,0,0,0,0,0,0,0,0,0,,0,1,0,0,0,0,,2,0,0,3,,,speech therapy,0
3150-23,2656-01,1,RLS,18/9/2018,TUE,1140,2,1,0,1,0,0,0,0,0,0,,0,0,1,1,0,0,0,0,0,0,0,,0,0,0,0,0,0,0,0,0,1,0,0,0,,0,0,0,0,0,0,0,0,0,,0,1,0,0,0,0,,,0,0,2,,,shower,0
3150-24,2656-01,1,RLS,18/9/2018,TUE,1150,2,1,0,1,0,0,0,0,0,0,,0,0,0,0,0,0,0,0,0,0,0,,0,1,0,0,0,0,0,0,0,1,0,0,0,,0,0,0,0,0,0,0,0,0,,0,0,0,0,0,0,,,0,0,1,,,shower,0
3150-25,2656-01,1,RLS,18/9/2018,TUE,1200,4,0,,,,,,,,,,,,,,,,,,,,,,,,,,,,,,,,,,,,,,,,,,,,,,,,,,,,,,,,,,,,0
3150-26,2656-01,1,RLS,18/9/2018,TUE,1210,0,0,1,0,0,0,0,0,0,0,,0,0,1,2,0,0,0,0,0,0,0,,0,0,0,0,0,0,0,0,1,0,0,0,0,,0,0,0,0,0,0,0,0,0,,0,1,0,0,0,0,,2,0,0,3,,,,0
3150-27,2656-01,1,RLS,18/9/2018,TUE,1220,0,0,1,0,0,0,0,0,0,0,,0,0,0,0,0,0,0,0,0,0,0,,0,1,0,0,0,0,0,0,1,0,0,0,0,,0,0,0,0,0,0,0,0,0,,0,0,0,0,0,0,,2,0,0,1,,,,0
3150-28,2656-01,1,RLS,18/9/2018,TUE,1230,0,0,0,0,0,0,0,0,0,1,communal lounge,0,0,0,0,0,0,0,0,0,0,1,researcher,1,0,0,0,0,0,0,0,0,0,0,0,0,,0,0,0,0,0,0,0,0,0,,0,1,0,0,0,0,,2,0,0,2,,,,0
3150-29,2656-01,1,RLS,18/9/2018,TUE,1240,0,0,0,0,0,0,0,0,0,1,communal lounge,0,0,0,0,1,1,0,0,1,1,1,researcher,1,0,0,0,0,0,0,0,0,0,0,0,0,,0,0,0,0,0,0,0,0,0,,0,1,0,0,0,0,,2,0,0,4,,,,0
3150-30,2656-01,1,RLS,18/9/2018,TUE,1250,0,0,0,0,0,0,1,0,0,0,,0,0,0,0,1,2,0,0,0,0,1,pastoral care x1 and researcher x1,2,0,0,0,0,0,0,0,0,0,0,0,0,,0,0,0,0,0,0,0,0,0,,0,1,0,0,0,0,,2,0,0,5,,,sitting just outside sunroom looking in to sunroom,0
3150-31,2656-01,1,RLS,18/9/2018,TUE,1300,0,0,0,0,0,0,1,0,0,0,,0,0,0,0,1,1,0,0,1,1,1,researcher,1,0,0,0,0,0,0,0,0,0,0,0,0,,0,0,0,0,0,0,0,0,0,,0,1,0,0,0,0,,2,0,0,4,,,sitting just outside sunroom looking in to sunroom,0
3150-32,2656-01,1,RLS,18/9/2018,TUE,1310,0,0,0,0,0,0,1,0,0,0,,0,0,0,0,1,2,0,0,1,1,1,researcher,1,0,0,0,0,0,0,0,0,0,0,0,0,,0,0,0,0,0,0,0,0,0,,0,1,0,0,0,0,,2,0,0,5,,,sitting just outside sunroom looking in to sunroom,0
3150-33,2656-01,1,RLS,18/9/2018,TUE,1320,0,0,1,0,0,0,0,0,0,0,,0,0,0,0,0,0,0,0,0,0,0,,0,1,0,0,0,0,0,0,0,0,0,0,0,,0,0,0,0,0,0,0,0,0,,0,0,0,0,0,0,,2,0,1,1,in wheelchair looking out window at construction,,,0
3150-34,2656-01,1,RLS,18/9/2018,TUE,1330,0,0,1,0,0,0,0,0,0,0,,0,0,1,1,0,0,0,0,0,0,0,,0,0,0,0,0,0,0,0,0,0,0,0,0,,0,0,0,0,0,0,0,0,0,,0,1,0,0,0,0,,2,0,0,2,looking out window at construction and nurse came in to check on him,,,0
3150-35,2656-01,1,RLS,18/9/2018,TUE,1340,0,0,1,0,0,0,0,0,0,0,,0,0,0,0,0,0,0,0,0,0,0,,0,1,0,0,0,0,0,0,0,0,0,0,0,,0,0,0,0,0,0,0,0,0,,0,0,0,0,0,0,,2,1,1,1,sleeping,,in wheelchair,0
3150-36,2656-01,1,RLS,18/9/2018,TUE,1350,0,0,1,0,0,0,0,0,0,0,,0,0,0,0,0,0,0,0,0,0,0,,0,1,0,0,0,0,0,0,0,0,0,0,0,,0,0,0,0,0,0,0,0,0,,0,0,0,0,0,0,,2,0,1,1,in wheelchair looking out window at construction,,,0
3150-37,2656-01,1,RLS,18/9/2018,TUE,1400,0,0,0,0,0,0,0,1,0,0,,0,0,0,0,0,0,1,3,0,0,0,,0,0,0,0,0,0,0,0,0,0,0,1,0,,0,0,0,0,0,0,0,0,0,,0,1,0,0,0,0,,2,0,0,11,,,,0
3150-38,2656-01,1,RLS,18/9/2018,TUE,1410,4,1,0,0,0,0,0,1,0,0,,,,,,,,,,,,,,,,,,,,,,,,,,,,,,,,,,,,,,,,,,,,,,,,,,,,0
3150-39,2656-01,1,RLS,18/9/2018,TUE,1420,0,0,0,0,0,0,0,1,0,0,,0,0,0,0,0,0,1,3,0,0,0,,0,0,0,1,0,0,0,0,0,0,0,0,0,,0,0,0,0,0,0,0,0,0,,0,1,0,0,0,0,,2,0,0,9,,,sitting on bed and physio looking at sore back,0
3150-40,2656-01,1,RLS,18/9/2018,TUE,1430,0,0,0,0,0,0,0,1,0,0,,0,0,0,0,0,0,1,3,0,0,0,,0,0,0,0,0,0,0,0,0,0,0,1,0,,0,0,0,0,0,0,0,0,0,,0,1,0,0,0,0,,2,0,0,10,,,,0
3150-41,2656-01,1,RLS,18/9/2018,TUE,1440,0,0,0,0,0,0,0,1,0,0,,0,0,0,0,0,0,1,3,0,0,0,,0,0,0,0,0,0,0,0,0,0,0,1,0,,0,0,0,0,0,0,0,0,0,,0,1,0,0,0,0,,3,0,0,4,,,,0
3150-42,2656-01,1,RLS,18/9/2018,TUE,1450,0,0,0,0,0,0,0,1,0,0,,0,0,0,0,0,0,1,3,0,0,0,,0,0,0,1,0,0,0,0,0,0,0,0,0,,0,0,0,0,0,0,0,0,0,,0,1,0,0,0,0,,2,0,0,5,,,,0
3150-43,2656-01,1,RLS,18/9/2018,TUE,1500,0,0,0,0,0,0,1,0,0,0,,0,0,0,0,0,0,1,1,0,0,0,,0,0,0,0,0,0,0,0,0,0,0,0,0,,0,0,0,0,0,0,0,0,0,,0,0,0,0,0,0,,2,0,1,4,waiting for lift in hallway,,,0
3150-44,2656-01,1,RLS,18/9/2018,TUE,1510,0,0,1,0,0,0,0,0,0,0,,0,0,0,0,0,0,0,0,0,0,1,allied health assistant,1,0,0,0,0,0,0,0,0,0,0,1,0,,0,0,0,0,0,0,0,0,0,,0,1,0,0,0,0,,2,0,0,2,,,upper limb therapy,0
3150-45,2656-01,1,RLS,18/9/2018,TUE,1520,0,0,1,0,0,0,0,0,0,0,,0,0,0,0,0,0,0,0,0,0,1,allied health assistant,1,0,0,0,0,0,0,0,0,0,0,1,0,,0,0,0,0,0,0,0,0,0,,0,1,0,0,0,0,,2,0,0,2,,,upper limb therapy,0
3150-46,2656-01,1,RLS,18/9/2018,TUE,1530,0,0,1,0,0,0,0,0,0,0,,0,0,0,0,0,0,0,0,0,0,1,allied health assistant,1,0,0,0,0,0,0,0,0,0,0,1,0,,0,0,0,0,0,0,0,0,0,,0,1,0,0,0,0,,2,0,0,2,,,upper limb therapy,0
3150-47,2656-01,1,RLS,18/9/2018,TUE,1540,0,0,1,0,0,0,0,0,0,0,,0,0,0,0,0,0,0,0,0,0,1,allied health assistant,1,0,0,0,0,0,0,0,0,0,0,0,0,,0,0,0,0,0,0,0,0,0,,0,0,0,0,0,0,,2,0,1,2,sitting in wheelchair while allied health assistant taped up his arm,,,0
3150-48,2656-01,1,RLS,18/9/2018,TUE,1550,0,0,1,0,0,0,0,0,0,0,,0,0,0,0,1,1,0,0,0,0,0,,0,0,0,0,0,0,0,0,0,0,0,0,0,,0,0,0,0,0,0,0,0,0,,0,1,0,0,0,0,,2,0,0,2,,,,0
3150-49,2656-01,1,RLS,18/9/2018,TUE,1600,0,0,1,0,0,0,0,0,0,0,,1,1,0,0,0,0,0,0,0,0,0,,0,0,0,1,0,0,0,0,0,0,0,0,0,,0,0,0,0,0,0,0,0,0,,0,1,0,0,0,0,,2,0,0,2,,,talking with dr,0
3150-50,2656-01,1,RLS,18/9/2018,TUE,1610,0,0,1,0,0,0,0,0,0,0,,0,0,0,0,0,0,0,0,0,0,0,,0,0,0,1,0,0,0,0,0,0,0,0,0,,0,0,0,0,0,0,0,0,0,,0,0,0,0,0,0,,2,0,0,1,,,putting something on bed,0
3150-51,2656-01,1,RLS,18/9/2018,TUE,1620,0,0,1,0,0,0,0,0,0,0,,0,0,0,0,1,1,0,0,0,0,1,allied health assistant,1,0,0,1,0,0,0,0,0,0,0,0,0,,0,0,0,0,0,0,0,0,0,,0,1,0,0,0,0,,2,0,0,3,,,,0
3150-52,2656-01,1,RLS,18/9/2018,TUE,1630,0,0,1,0,0,0,0,0,0,0,,0,0,0,0,0,0,0,0,0,0,0,,0,1,0,0,0,0,0,0,0,0,0,0,0,,0,0,0,0,0,0,0,0,0,,0,0,0,1,0,0,,2,0,0,1,,,talking with family on phone,0
3150-53,2656-01,1,RLS,18/9/2018,TUE,1640,0,0,1,0,0,0,0,0,0,0,,0,0,1,2,0,0,0,0,0,0,0,,0,0,0,0,0,0,0,0,0,0,0,0,0,,0,0,0,0,0,0,0,0,0,,0,1,0,0,0,0,,2,0,0,3,,,nurse giving him medication,0
3150-54,2656-01,1,RLS,18/9/2018,TUE,1650,0,0,0,0,0,0,1,0,0,0,,0,0,0,0,0,0,0,0,0,0,1,researcher,1,0,0,0,0,0,0,0,0,0,0,0,0,,0,0,0,0,0,0,0,0,0,,0,1,0,0,0,0,,2,0,0,2,,,,0
3150-55,2656-02,1,RLS,25/10/2018,THU,800,0,0,1,0,0,0,0,0,0,0,,0,0,0,0,0,0,0,0,0,0,0,,0,1,0,0,0,0,0,0,1,0,0,0,0,,0,0,0,0,0,0,0,0,0,,0,0,0,0,0,0,,2,0,0,1,,,door closed,0
3150-56,2656-02,1,RLS,25/10/2018,THU,810,0,0,1,0,0,0,0,0,0,0,,0,0,0,0,0,0,0,0,0,0,0,,0,1,0,0,0,0,0,0,0,0,0,0,0,,0,0,0,1,0,0,0,0,0,,0,0,0,0,0,0,,2,0,0,1,,,door closed,0
3150-57,2656-02,1,RLS,25/10/2018,THU,820,0,0,1,0,0,0,0,0,0,0,,0,0,0,0,0,0,0,0,0,0,0,,0,1,0,0,0,0,0,0,1,0,0,0,0,,0,0,0,1,0,0,0,0,0,,0,0,0,0,0,0,,2,0,0,1,,,door closed,0
3150-58,2656-02,1,RLS,25/10/2018,THU,830,0,0,1,0,0,0,0,0,0,0,,0,0,0,0,0,0,0,0,0,0,0,,0,1,0,0,0,0,0,1,0,0,0,0,0,,0,0,0,0,0,0,0,0,0,,0,0,0,0,0,0,,3,0,0,1,,,door closed,0
3150-59,2656-02,1,RLS,25/10/2018,THU,840,0,0,1,0,0,0,0,0,0,0,,0,0,0,0,0,0,0,0,0,0,0,,0,1,0,1,0,0,0,0,0,0,0,0,0,,0,0,0,0,0,0,0,0,1,sorting papers,0,0,0,0,0,0,,2,0,0,1,,,door closed,0
3150-60,2656-02,1,RLS,25/10/2018,THU,850,0,0,1,0,0,0,0,0,0,0,,0,0,0,0,0,0,0,0,0,0,0,,0,1,0,0,0,0,0,0,0,0,0,0,0,,0,0,0,1,0,0,0,0,0,,0,0,0,0,0,0,,2,0,0,1,,,door closed,0
3150-61,2656-02,1,RLS,25/10/2018,THU,900,0,0,1,0,0,0,0,0,0,0,,0,0,0,0,0,0,0,0,0,0,0,,0,1,0,0,0,0,0,0,0,0,0,0,0,,0,0,0,1,0,0,0,0,0,,0,0,0,0,0,0,,2,0,0,1,,,door closed,0
3150-62,2656-02,1,RLS,25/10/2018,THU,910,0,0,1,0,0,0,0,0,0,0,,0,0,0,0,0,0,0,0,0,0,1,cleaner,1,0,0,0,0,0,0,0,0,0,0,0,0,,0,0,0,0,0,0,0,0,0,,0,1,0,0,0,0,,2,0,0,2,,,door closed,0
3150-63,2656-02,1,RLS,25/10/2018,THU,920,0,0,1,0,0,0,0,0,0,0,,0,0,0,0,0,0,0,0,0,0,0,,0,1,0,0,0,1,0,0,0,0,0,0,0,,0,0,0,0,0,0,0,0,0,,0,0,0,0,0,0,,3,0,0,1,,,door open,0
3150-64,2656-02,1,RLS,25/10/2018,THU,930,4,0,,,,,,,,,,,,,,,,,,,,,,,,,,,,,,,,,,,,,,,,,,,,,,,,,,,,,,,,,,,,0
3150-65,2656-02,1,RLS,25/10/2018,THU,940,0,0,0,0,0,0,0,0,0,1,caf�,0,0,0,0,1,2,0,0,0,0,1,caf_ staff,2,0,0,0,0,0,0,1,0,0,0,0,0,,0,0,0,0,0,0,0,0,0,,0,0,0,0,0,0,,1,0,0,5,,,at caf_,0
3150-66,2656-02,1,RLS,25/10/2018,THU,950,0,0,1,0,0,0,0,0,0,0,,0,0,0,0,0,0,0,0,0,0,0,,0,1,0,0,0,0,0,0,0,0,0,0,0,,0,0,0,1,0,0,0,0,0,,0,0,0,0,0,0,,2,0,0,1,,,door open,0
3150-67,2656-02,1,RLS,25/10/2018,THU,1000,0,0,1,0,0,0,0,0,0,0,,0,0,0,0,0,0,0,0,0,0,0,,0,1,0,0,0,0,0,0,1,0,0,0,0,,0,0,1,0,0,0,0,0,0,,0,0,0,0,0,0,,2,0,0,1,,,door open,0
3150-68,2656-02,1,RLS,25/10/2018,THU,1010,0,0,1,0,0,0,0,0,0,0,,0,0,0,0,0,0,0,0,0,0,0,,0,1,0,0,0,0,0,0,1,0,0,0,0,,0,0,1,0,0,0,0,0,0,,0,0,0,0,0,0,,2,0,0,1,,,door open,0
3150-69,2656-02,1,RLS,25/10/2018,THU,1020,1,1,0,0,0,0,0,0,1,0,,0,0,0,0,0,0,0,0,1,1,0,,0,0,0,0,0,0,0,1,0,0,0,0,0,,0,0,0,0,0,0,0,0,0,,0,1,0,0,0,0,,2,0,0,3,,,out for coffee with brother outside hospital,0
3150-70,2656-02,1,RLS,25/10/2018,THU,1030,1,1,0,0,0,0,0,0,1,0,,0,0,0,0,0,0,0,0,1,1,0,,0,0,0,0,0,0,0,0,0,0,0,0,0,,0,0,0,0,0,0,0,0,0,,0,1,0,0,0,0,,2,0,0,2,,,out for coffee with brother outside hospital,0
3150-71,2656-02,1,RLS,25/10/2018,THU,1040,1,1,0,0,0,0,0,0,1,0,,0,0,0,0,0,0,0,0,1,1,0,,0,0,0,0,0,0,0,0,0,0,0,0,0,,0,0,0,0,0,0,0,0,0,,0,1,0,0,0,0,,2,0,0,2,,,out for coffee with brother outside hospital,0
3150-72,2656-02,1,RLS,25/10/2018,THU,1050,1,1,0,0,0,0,0,0,1,0,,0,0,0,0,0,0,0,0,1,1,0,,0,0,0,0,0,0,0,0,1,0,0,0,0,,0,0,0,0,0,0,0,0,0,,0,1,0,0,0,0,,2,0,0,2,,,out for coffee with brother outside hospital,0
3150-73,2656-02,1,RLS,25/10/2018,THU,1100,1,1,0,0,0,0,0,0,1,0,,0,0,0,0,0,0,0,0,1,1,0,,0,0,0,0,0,0,0,0,1,0,0,0,0,,0,0,0,0,0,0,0,0,0,,0,1,0,0,0,0,,2,0,0,2,,,out for coffee with brother outside hospital,0
3150-74,2656-02,1,RLS,25/10/2018,THU,1110,1,1,0,0,0,0,0,0,1,0,,0,0,0,0,0,0,0,0,1,1,0,,0,0,0,0,0,0,0,0,1,0,0,0,0,,0,0,0,0,0,0,0,0,0,,0,1,0,0,0,0,,2,0,0,2,,,out for coffee with brother outside hospital,0
3150-75,2656-02,1,RLS,25/10/2018,THU,1120,1,1,0,0,0,0,0,0,1,0,,0,0,0,0,0,0,0,0,1,1,0,,0,0,0,0,0,0,0,0,1,0,0,0,0,,0,0,0,0,0,0,0,0,0,,0,1,0,0,0,0,,2,0,0,2,,,out for coffee with brother outside hospital,0
3150-76,2656-02,1,RLS,25/10/2018,THU,1130,1,1,0,0,0,0,0,0,1,0,,0,0,0,0,0,0,0,0,1,1,0,,0,0,0,0,0,0,0,1,0,0,0,0,0,,0,0,0,0,0,0,0,0,0,,0,1,0,0,0,0,,3,0,0,2,,,out for coffee with brother outside hospital,0
3150-77,2656-02,1,RLS,25/10/2018,THU,1140,0,0,0,0,0,0,1,0,0,0,,0,0,1,6,0,0,0,0,1,1,0,,0,0,0,0,0,0,0,1,0,0,0,0,0,,0,0,0,0,0,0,0,0,0,,0,1,0,0,0,0,,3,0,0,8,,,,0
3150-78,2656-02,1,RLS,25/10/2018,THU,1150,0,0,1,0,0,0,0,0,0,0,,0,0,0,0,0,0,1,1,1,1,0,,0,0,0,0,0,0,0,0,0,0,0,0,0,,0,0,0,0,0,0,0,0,0,,0,1,0,0,0,0,,2,0,0,3,,,door open,0
3150-79,2656-02,1,RLS,25/10/2018,THU,1200,0,0,1,0,0,0,0,0,0,0,,0,0,0,0,0,0,0,0,0,0,0,,0,1,0,0,0,0,0,0,1,0,0,0,0,,0,0,0,0,0,0,0,0,0,,0,0,0,0,0,0,,2,0,0,1,,,door open,0
3150-80,2656-02,1,RLS,25/10/2018,THU,1210,4,1,1,0,0,0,0,0,0,0,,,,,,,,,,,,,,,,,,,,,,,,,,,,,,,,,,,,,,,,,,,,,,,,,,,,0
3150-81,2656-02,1,RLS,25/10/2018,THU,1220,0,0,1,0,0,0,0,0,0,0,,0,0,0,0,0,0,0,0,0,0,0,,0,1,0,0,0,0,0,0,1,0,0,0,0,,0,0,0,0,0,0,1,0,0,,0,0,0,0,0,0,,2,0,0,1,,,door open,0
3150-82,2656-02,1,RLS,25/10/2018,THU,1230,0,0,1,0,0,0,0,0,0,0,,0,0,0,0,0,0,0,0,0,0,0,,0,1,0,0,0,0,0,0,1,0,0,0,0,,0,0,0,1,0,0,0,0,0,,0,0,0,0,0,0,,2,0,0,1,,,door open,0
3150-83,2656-02,1,RLS,25/10/2018,THU,1240,0,0,1,0,0,0,0,0,0,0,,0,0,0,0,0,0,0,0,0,0,0,,0,1,0,0,0,0,0,0,1,0,0,0,0,,0,0,1,0,0,0,0,0,0,,0,0,0,0,0,0,,2,0,0,1,,,door open,0
3150-84,2656-02,1,RLS,25/10/2018,THU,1250,0,0,1,0,0,0,0,0,0,0,,0,0,0,0,0,0,0,0,1,1,0,,0,0,0,1,0,0,0,0,0,0,0,0,0,,0,0,0,0,0,0,0,0,0,,0,1,0,0,0,0,,2,0,0,2,,,door open cousin visiting,0
3150-85,2656-02,1,RLS,25/10/2018,THU,1300,0,0,1,0,0,0,0,0,0,0,,0,0,0,0,0,0,0,0,1,1,0,,0,0,0,0,0,0,0,0,0,0,0,0,0,,0,0,0,0,0,0,0,0,0,,0,1,0,0,0,0,,2,0,0,2,,,door open cousin visiting,0
3150-86,2656-02,1,RLS,25/10/2018,THU,1310,0,0,1,0,0,0,0,0,0,0,,0,0,0,0,0,0,0,0,1,1,0,,0,0,0,1,0,0,0,0,0,0,0,0,0,,0,0,0,0,0,0,0,0,0,,0,1,0,0,0,0,,2,0,0,2,,,door open cousin visiting,0
3150-87,2656-02,1,RLS,25/10/2018,THU,1320,1,1,0,0,0,0,0,1,0,0,,0,0,0,0,0,0,1,1,0,0,0,,0,0,0,0,0,0,0,0,0,0,0,0,0,,0,0,0,0,0,0,0,1,0,,0,1,0,0,0,0,,2,0,0,2,,,speech therapy,0
3150-88,2656-02,1,RLS,25/10/2018,THU,1330,1,1,0,0,0,0,0,1,0,0,,0,0,0,0,0,0,1,1,0,0,0,,0,0,0,0,0,0,0,0,0,0,0,0,0,,0,0,0,0,0,0,0,1,0,,0,1,0,0,0,0,,2,0,0,2,,,speech therapy,0
3150-89,2656-02,1,RLS,25/10/2018,THU,1340,1,1,0,0,0,0,0,1,0,0,,0,0,0,0,0,0,1,1,0,0,0,,0,0,0,0,0,0,0,0,0,0,0,0,0,,0,0,0,0,0,0,0,1,0,,0,1,0,0,0,0,,2,0,0,2,,,speech therapy,0
3150-90,2656-02,1,RLS,25/10/2018,THU,1350,1,1,0,0,0,0,0,1,0,0,,0,0,0,0,0,0,1,1,0,0,0,,0,0,0,0,0,0,0,0,0,0,0,0,0,,0,0,0,0,0,0,0,1,0,,0,1,0,0,0,0,,2,0,0,2,,,speech therapy,0
3150-91,2656-02,1,RLS,25/10/2018,THU,1400,0,0,1,0,0,0,0,0,0,0,,0,0,0,0,0,0,0,0,0,0,0,,0,1,0,0,0,0,0,1,0,0,0,0,0,,0,0,0,0,0,0,0,0,0,,0,0,0,0,0,0,,3,0,0,1,,,door closed,0
3150-92,2656-02,1,RLS,25/10/2018,THU,1410,0,0,1,0,0,0,0,0,0,0,,0,0,0,0,0,0,0,0,0,0,0,,0,1,0,0,0,0,0,0,1,0,0,0,0,,0,0,0,0,0,0,1,0,0,,0,0,0,0,0,0,,2,0,0,1,,,door open,0
3150-93,2656-02,1,RLS,25/10/2018,THU,1420,0,0,1,0,0,0,0,0,0,0,,0,0,0,0,0,0,0,0,0,0,0,,0,1,0,0,0,0,0,0,1,0,0,0,0,,0,0,0,0,0,0,1,0,0,,0,0,0,0,0,0,,2,0,0,1,,,door open,0
3150-94,2656-02,1,RLS,25/10/2018,THU,1430,0,0,1,0,0,0,0,0,0,0,,0,0,0,0,0,0,0,0,0,0,0,,0,1,0,0,0,0,0,0,1,0,0,0,0,,0,0,0,1,0,0,0,0,0,,0,0,0,0,0,0,,2,0,0,1,,,door open,0
3150-95,2656-02,1,RLS,25/10/2018,THU,1440,0,0,1,0,0,0,0,0,0,0,,0,0,0,0,0,0,0,0,0,0,0,,0,1,0,0,0,0,0,0,1,0,0,0,0,,0,0,0,1,0,0,0,0,0,,0,0,0,0,0,0,,2,0,0,1,,,door open,0
3150-96,2656-02,1,RLS,25/10/2018,THU,1450,0,0,1,0,0,0,0,0,0,0,,0,0,0,0,0,0,0,0,0,0,0,,0,1,0,0,0,0,0,0,1,0,0,0,0,,0,0,0,1,0,0,0,0,0,,0,0,0,0,0,0,,2,0,0,1,,,door open,0
3150-97,2656-02,1,RLS,25/10/2018,THU,1500,2,1,0,1,0,0,0,0,0,0,,0,0,0,0,0,0,0,0,0,0,0,,0,1,0,0,0,0,0,0,0,1,0,0,0,,0,0,0,0,0,0,0,0,0,,0,0,0,0,0,0,,2,0,0,1,,,,0
3150-98,2656-02,1,RLS,25/10/2018,THU,1510,4,0,,,,,,,,,,,,,,,,,,,,,,,,,,,,,,,,,,,,,,,,,,,,,,,,,,,,,,,,,,,,0
3150-101,2656-02,1,RLS,25/10/2018,THU,1540,0,0,1,0,0,0,0,0,0,0,,0,0,0,0,0,0,0,0,0,0,0,,0,1,0,0,0,0,0,1,0,0,0,0,0,,0,0,0,0,0,0,0,0,0,,0,0,0,0,0,0,,3,0,0,1,,,door closed,0
3150-102,2656-02,1,RLS,25/10/2018,THU,1550,0,0,1,0,0,0,0,0,0,0,,0,0,0,0,0,0,0,0,0,0,0,,0,1,0,0,0,0,0,0,1,0,0,0,0,,0,0,0,0,0,0,1,0,0,,0,0,0,0,0,0,,2,0,0,1,,,door closed,0
3150-103,2656-02,1,RLS,25/10/2018,THU,1600,0,0,1,0,0,0,0,0,0,0,,0,0,0,0,0,0,1,1,0,0,0,,0,0,0,1,0,0,0,0,0,0,0,0,0,,0,0,0,0,0,0,0,0,0,,0,1,0,0,0,0,,2,0,0,2,,,door closed,0
3150-104,2656-02,1,RLS,25/10/2018,THU,1610,0,0,1,0,0,0,0,0,0,0,,0,0,0,0,0,0,0,0,0,0,0,,0,1,0,0,0,1,0,0,0,0,0,0,0,,0,0,0,0,0,0,0,0,0,,0,0,0,0,0,0,,3,0,0,1,,,door open,0
3150-105,2656-02,1,RLS,25/10/2018,THU,1620,0,0,0,0,0,0,1,0,0,0,,0,0,0,0,1,1,0,0,0,0,0,,0,0,0,0,0,1,0,0,0,0,0,0,0,,0,0,0,0,0,0,0,0,0,,0,1,0,0,0,0,,3,0,0,2,,,standing in bedroom doorway talking to another patient,0
3150-106,2656-02,1,RLS,25/10/2018,THU,1630,0,0,0,0,0,0,1,0,0,0,,0,0,0,0,1,1,0,0,0,0,0,,0,0,0,0,0,1,0,0,0,0,0,0,0,,0,0,0,0,0,0,0,0,0,,0,1,0,0,0,0,,3,0,0,2,,,standing in bedroom doorway talking to another patient,0
3150-107,2656-02,1,RLS,25/10/2018,THU,1640,0,0,0,0,0,0,1,0,0,0,,0,0,0,0,1,1,0,0,0,0,0,,0,0,0,0,0,1,0,0,0,0,0,0,0,,0,0,0,0,0,0,0,0,0,,0,1,0,0,0,0,,3,0,0,2,,,standing in bedroom doorway talking to another patient,0
3150-108,2656-02,1,RLS,25/10/2018,THU,1650,0,0,0,0,0,0,1,0,0,0,,0,0,0,0,1,1,0,0,0,0,0,,0,0,0,0,0,1,0,0,0,0,0,0,0,,0,0,0,0,0,0,0,0,0,,0,1,0,0,0,0,,3,0,0,2,,,standing in bedroom doorway talking to another patient,0
3150-109,2656-03,1,RLS,25/10/2018,THU,800,0,0,1,0,0,0,0,0,0,0,,0,0,0,0,0,0,0,0,0,0,0,,0,1,0,0,0,0,0,0,1,0,0,0,0,,0,0,0,0,0,0,0,0,0,,0,0,0,0,0,0,,2,0,0,1,,,breakfast,0
3150-110,2656-03,1,RLS,25/10/2018,THU,810,0,0,1,0,0,0,0,0,0,0,,0,0,0,0,0,0,0,0,0,0,0,,0,1,0,0,0,0,0,0,1,0,0,0,0,,0,0,0,0,0,0,0,0,0,,0,0,0,0,0,0,,2,0,0,1,,,breakfast,0
3150-111,2656-03,1,RLS,25/10/2018,THU,820,0,0,1,0,0,0,0,0,0,0,,0,0,0,0,0,0,0,0,0,0,0,,0,1,0,0,0,0,0,0,0,0,0,0,1,reposition cord on chair,0,0,0,0,0,0,0,0,0,,0,0,0,0,0,0,,2,0,0,1,,,,0
3150-112,2656-03,1,RLS,25/10/2018,THU,830,0,0,1,0,0,0,0,0,0,0,,0,0,0,0,0,0,0,0,0,0,0,,0,1,0,0,0,0,0,0,0,0,0,0,1,using remote,0,0,0,0,0,0,0,0,0,,0,0,0,0,0,0,,2,0,0,1,,,watching TV,0
3150-113,2656-03,1,RLS,25/10/2018,THU,840,0,0,1,0,0,0,0,0,0,0,,0,0,0,0,0,0,0,0,0,0,0,,0,1,0,0,0,0,0,0,0,0,0,0,0,,0,0,0,1,0,0,0,0,0,,0,0,0,0,0,0,,2,0,0,1,,,,0
3150-114,2656-03,1,RLS,25/10/2018,THU,850,0,0,1,0,0,0,0,0,0,0,,0,0,1,1,0,0,0,0,0,0,0,,0,0,0,0,0,0,0,0,0,0,0,0,0,,0,0,0,0,0,0,0,0,0,,1,0,0,0,0,0,,2,0,0,2,,,getting blood pressure checked,0
3150-115,2656-03,1,RLS,25/10/2018,THU,900,0,0,1,0,0,0,0,0,0,0,,0,0,1,3,0,0,0,0,0,0,0,,0,0,0,0,0,0,0,0,0,0,0,0,0,,0,0,0,0,0,0,0,0,0,,0,1,0,0,0,0,,2,0,0,4,,,watching TV and medications being dispensed,0
3150-116,2656-03,1,RLS,25/10/2018,THU,910,0,0,1,0,0,0,0,0,0,0,,0,0,1,2,0,0,0,0,0,0,0,,0,0,0,0,0,0,0,0,0,0,0,0,0,,0,0,0,1,0,0,0,0,0,,0,0,0,0,0,0,,2,0,0,3,,,nurse changing bed,0
3150-117,2656-03,1,RLS,25/10/2018,THU,920,0,0,1,0,0,0,0,0,0,0,,0,0,0,0,0,0,0,0,0,0,0,,0,1,0,0,0,0,0,0,0,0,0,0,0,,0,0,0,1,0,0,0,0,0,,0,0,0,0,0,0,,2,0,0,1,,,,0
3150-118,2656-03,1,RLS,25/10/2018,THU,930,4,1,1,0,0,0,0,0,0,0,,0,0,0,0,0,0,0,0,0,0,0,,0,1,0,0,0,0,0,0,0,0,0,0,0,,0,0,0,1,0,0,0,0,0,,0,0,0,0,0,0,,2,0,0,1,,,,0
3150-119,2656-03,1,RLS,25/10/2018,THU,940,0,0,1,0,0,0,0,0,0,0,,0,0,0,0,0,0,0,0,0,0,0,,0,1,0,0,0,0,0,0,0,0,0,0,0,,0,0,0,1,0,0,0,0,0,,0,0,0,0,0,0,,2,0,0,1,,,,0
3150-120,2656-03,1,RLS,25/10/2018,THU,950,2,1,1,0,0,0,0,0,0,0,,0,0,1,2,0,0,0,0,0,0,0,,0,0,0,0,0,0,0,0,0,0,0,0,0,,0,0,0,0,0,0,0,0,0,,0,1,0,0,0,0,,1,0,0,3,,,,0
3150-121,2656-03,1,RLS,25/10/2018,THU,1000,0,0,0,1,0,0,0,0,0,0,,0,0,1,2,0,0,0,0,0,0,0,,0,0,0,0,0,0,0,0,0,1,0,0,0,,0,0,0,0,0,0,0,0,0,,0,1,0,0,0,0,,3,0,0,3,,,,0
3150-122,2656-03,1,RLS,25/10/2018,THU,1010,2,1,0,1,0,0,0,0,0,0,,0,0,0,0,0,0,0,0,0,0,0,,0,1,0,0,0,0,0,0,0,1,0,0,0,,0,0,0,0,0,0,0,0,0,,0,0,0,0,0,0,,2,0,0,1,,,,0
3150-123,2656-03,1,RLS,25/10/2018,THU,1020,2,1,0,1,0,0,0,0,0,0,,0,0,1,1,0,0,0,0,0,0,0,,0,0,0,0,0,0,0,0,0,1,0,0,0,,0,0,0,0,0,0,0,0,0,,0,1,0,0,0,0,,2,0,0,2,,,showering,0
3150-124,2656-03,1,RLS,25/10/2018,THU,1030,2,1,1,0,0,0,0,0,0,0,,0,0,1,2,0,0,0,0,0,0,0,,0,0,0,0,0,0,0,0,0,1,0,0,0,,0,0,0,0,0,0,0,0,0,,1,0,0,0,0,0,,2,0,0,3,,,,0
3150-125,2656-03,1,RLS,25/10/2018,THU,1040,2,1,1,0,0,0,0,0,0,0,,0,0,1,1,0,0,0,0,0,0,0,,0,0,0,0,0,0,0,0,0,1,0,0,0,,0,0,0,0,0,0,0,0,0,,0,1,0,0,0,0,,2,0,0,3,,,being dressed,0
3150-126,2656-03,1,RLS,25/10/2018,THU,1050,0,0,1,0,0,0,0,0,0,0,,0,0,0,0,0,0,0,0,0,0,0,,0,1,0,0,0,0,0,0,0,0,0,0,0,,0,0,0,0,0,0,0,0,0,,0,0,0,0,0,0,,1,0,1,1,lying in bed,,,0
3150-127,2656-03,1,RLS,25/10/2018,THU,1100,0,0,1,0,0,0,0,0,0,0,,0,0,0,0,0,0,0,0,0,0,1,cleaner,1,0,0,0,0,0,0,0,0,0,0,0,0,,0,0,0,0,0,0,0,0,0,,0,0,0,0,0,0,,1,1,1,2,sleeping,,,0
3150-128,2656-03,1,RLS,25/10/2018,THU,1110,0,0,1,0,0,0,0,0,0,0,,0,0,0,0,0,0,0,0,0,0,1,cleaner,2,0,0,0,0,0,0,0,0,0,0,0,0,,0,0,0,0,0,0,0,0,0,,0,0,0,0,0,0,,1,1,1,3,sleeping,,,0
3150-129,2656-03,1,RLS,25/10/2018,THU,1120,0,0,1,0,0,0,0,0,0,0,,0,0,0,0,0,0,0,0,0,0,0,,0,1,0,0,0,0,0,0,0,0,0,0,0,,0,0,0,0,0,0,0,0,0,,0,0,0,0,0,0,,1,1,1,1,sleeping,,,0
3150-130,2656-03,1,RLS,25/10/2018,THU,1130,0,0,1,0,0,0,0,0,0,0,,0,0,0,0,0,0,0,0,0,0,0,,0,1,0,0,0,0,0,0,0,0,0,0,0,,0,0,0,0,0,0,0,0,0,,0,0,0,0,0,0,,1,1,1,1,sleeping,,,0
3150-131,2656-03,1,RLS,25/10/2018,THU,1140,0,0,1,0,0,0,0,0,0,0,,0,0,0,0,0,0,0,0,1,1,0,,0,0,0,0,0,0,0,0,0,0,0,0,0,,0,0,0,0,0,0,0,0,0,,0,1,0,0,0,0,,1,0,0,2,,,,0
3150-132,2656-03,1,RLS,25/10/2018,THU,1150,0,0,1,0,0,0,0,0,0,0,,0,0,0,0,0,0,0,0,1,1,0,,0,0,0,0,0,0,0,0,0,0,0,0,0,,0,0,0,0,0,0,0,0,0,,0,0,0,0,0,0,,1,0,1,2,lying eyes open,,,0